9

So I recently joined the Mac world and bought a MacBook - which I love, by the way.

I'm having some trouble getting all my dev tools up setup properly and am not quite 100% familiar with the differences in the Linux CLI and the OSX CLI.

Right now, I'm trying to install a few different versions of Ruby via RVM.

I've tried getting gcc4.2 as I've seen recommended, but regardless of what compiler I use I get similar messages. In this I'm trying to install the 2.0.0-preview2, but I get the same messages for other versions also:

$ rvm install 2.0.0-preview2
No binary rubies available for: downloads/ruby-2.0.0-preview2.
Continuing with compilation. Please read 'rvm mount' to get more information on binary rubies.
Fetching openssl-1.0.1c.tar.gz to /usr/local/rvm/archives
Extracting openssl to /usr/local/rvm/src/openssl-1.0.1c
Configuring openssl in /usr/local/rvm/src/openssl-1.0.1c.
Error running 'env LDFLAGS=-L/opt/sm/pkg/active/lib CFLAGS=-I/opt/sm/pkg/active/include CPATH=/opt/sm/pkg/active/include ./Configure darwin64-x86_64-cc -I/usr/local/rvm/usr/include -L/usr/local/rvm/usr/lib zlib no-asm no-krb5 shared --prefix=/usr/local/rvm/usr --with-opt-dir=/usr/local/rvm/usr', please read /usr/local/rvm/log/ruby-2.0.0-preview2/openssl/configure.log
Compiling openssl in /usr/local/rvm/src/openssl-1.0.1c.
Error running 'make', please read /usr/local/rvm/log/ruby-2.0.0-preview2/openssl/make.log
Updating openssl certificates
Error running 'update_openssl_certs', please read /usr/local/rvm/log/ruby-2.0.0-preview2/openssl.certs.log
Installing Ruby from source to: /usr/local/rvm/rubies/ruby-2.0.0-preview2, this may take a while depending on your cpu(s)...
ruby-2.0.0-preview2 - #downloading ruby-2.0.0-preview2, this may take a while depending on your connection...
ruby-2.0.0-preview2 - #extracted to /usr/local/rvm/src/ruby-2.0.0-preview2 (already extracted)
ruby-2.0.0-preview2 - #configuring
Error running 'env LDFLAGS=-L/opt/sm/pkg/active/lib CFLAGS=-I/opt/sm/pkg/active/include CPATH=/opt/sm/pkg/active/include ./configure --enable-shared --disable-install-doc --prefix=/usr/local/rvm/rubies/ruby-2.0.0-preview2 --with-opt-dir=/usr/local/rvm/usr:/usr/local/rvm/usr', please read /usr/local/rvm/log/ruby-2.0.0-preview2/configure.log
There has been an error while running configure. Halting the installation.

Here is the output of the four log files mentioned:

/usr/local/rvm/log/ruby-2.0.0-preview2/openssl/configure.log:

[2012-12-12 22:49:21] env LDFLAGS=-L/opt/sm/pkg/active/lib CFLAGS=-I/opt/sm/pkg/active/include CPATH=/opt/sm/pkg/active/include ./Configure darwin64-x86_64-cc -I/usr/local/rvm/usr/include -L/usr/local/rvm/usr/lib zlib no-asm no-krb5 shared --prefix=/usr/local/rvm/usr --with-opt-dir=/usr/local/rvm/usr
Usage: Configure [no-<cipher> ...] [enable-<cipher> ...] [experimental-<cipher> ...] [-Dxxx] [-lxxx] [-Lxxx] [-fxxx] [-Kxxx] [no-hw-xxx|no-hw] [[no-]threads] [[no-]shared] [[no-]zlib|zlib-dynamic] [no-asm] [no-dso] [no-krb5] [sctp] [386] [--prefix=DIR] [--openssldir=OPENSSLDIR] [--with-xxx[=vvv]] [--test-sanity] os/compiler[:flags]

/usr/local/rvm/log/ruby-2.0.0-preview2/openssl/make.log:

[2012-12-12 22:49:21] make
making all in crypto...
making all in crypto/objects...
/usr/bin/perl obj_dat.pl obj_mac.h obj_dat.h
/usr/bin/perl objxref.pl obj_mac.num obj_xref.txt > obj_xref.h
cc -I.. -I../.. -I../modes -I../asn1 -I../evp -I../../include  -O   -c -o obj_dat.o obj_dat.c
cc -I.. -I../.. -I../modes -I../asn1 -I../evp -I../../include  -O   -c -o obj_xref.o obj_xref.c
ar  r ../../libcrypto.a o_names.o obj_dat.o obj_lib.o obj_err.o obj_xref.o
/usr/bin/ranlib: file: ../../libcrypto.a(ebcdic.o) has no symbols
/usr/bin/ranlib: file: ../../libcrypto.a(fips_ers.o) has no symbols
/usr/bin/ranlib ../../libcrypto.a || echo Never mind.
/usr/bin/ranlib: file: ../../libcrypto.a(ebcdic.o) has no symbols
/usr/bin/ranlib: file: ../../libcrypto.a(fips_ers.o) has no symbols
making all in crypto/md4...
make[2]: Nothing to be done for `all'.
making all in crypto/md5...
make[2]: Nothing to be done for `all'.
making all in crypto/sha...
make[2]: Nothing to be done for `all'.
making all in crypto/mdc2...
make[2]: Nothing to be done for `all'.
making all in crypto/hmac...
make[2]: Nothing to be done for `all'.
making all in crypto/ripemd...
make[2]: Nothing to be done for `all'.
making all in crypto/whrlpool...
make[2]: Nothing to be done for `all'.
making all in crypto/des...
cc -I.. -I../.. -I../modes -I../asn1 -I../evp -I../../include  -O   -c -o set_key.o set_key.c
set_key.c:399:17: error: unsupported inline asm: input with type 'unsigned long' matching output with type 'unsigned int'
                *(k++)=ROTATE(t2,30)&0xffffffffL;
                       ~~~~~~~^~~~~~
./des_locl.h:170:19: note: expanded from macro 'ROTATE'
                                        : "I"(n),"0"(a) \
                                                     ^
set_key.c:402:17: error: unsupported inline asm: input with type 'unsigned long' matching output with type 'unsigned int'
                *(k++)=ROTATE(t2,26)&0xffffffffL;
                       ~~~~~~~^~~~~~
./des_locl.h:170:19: note: expanded from macro 'ROTATE'
                                        : "I"(n),"0"(a) \
                                                     ^
2 errors generated.
make[2]: *** [set_key.o] Error 1
make[1]: *** [subdirs] Error 1
make: *** [build_crypto] Error 1

/usr/local/rvm/log/ruby-2.0.0-preview2/openssl.certs.log:

[2012-12-12 22:49:24] update_openssl_certs
-bash: cd: /usr/local/rvm/usr/ssl: No such file or directory

/usr/local/rvm/log/ruby-2.0.0-preview2/configure.log:

[2012-12-12 22:49:24] env LDFLAGS=-L/opt/sm/pkg/active/lib CFLAGS=-I/opt/sm/pkg/active/include CPATH=/opt/sm/pkg/active/include ./configure --enable-shared --disable-install-doc --prefix=/usr/local/rvm/rubies/ruby-2.0.0-preview2 --with-opt-dir=/usr/local/rvm/usr:/usr/local/rvm/usr
checking build system type... x86_64-apple-darwin12.2.1
checking host system type... x86_64-apple-darwin12.2.1
checking target system type... x86_64-apple-darwin12.2.1
checking whether the C compiler works... no
configure: error: in `/usr/local/rvm/src/ruby-2.0.0-preview2':
configure: error: C compiler cannot create executables
See `config.log' for more details

OpenSSL has been installed via homebrew:

$ brew info openssl
openssl: stable 1.0.1c
http://openssl.org

This formula is keg-only.
Mac OS X already provides this software and installing another version in
parallel can cause all kinds of trouble.

The OpenSSL provided by OS X is too old for some software.

/usr/local/Cellar/openssl/1.0.1c (429 files, 15M)
https://github.com/mxcl/homebrew/commits/master/Library/Formula/openssl.rb

Could someone point me in the right direction? I feel like I'm missing something obvious.

Thanks in advance.

  • While I can not help you with the current question at hand, I would like to make a recommendation: Rephrase your question to have a short synopsis in the first lines, and then go into detail. Also, it might be easier to get answers if you break up your problem into several questions. Good luck! – myhd Dec 19 '12 at 13:19
2

Solved by re-installing Xcode, CLI tools, openssl (brew), autoconf (brew), automake (brew) and apple-gcc42 (brew). After re-installing I ran rvm get head (thanks to @mpapis in #rvm on freenode). rvm get head gave me the following:

  * WARNING: you have 'rvm_configure_env' in /etc/rvmrc, run the following to fix:

      sudo sed -i'' -e "s#rvm_configure_env=('LDFLAGS=-L/opt/sm/pkg/active/lib CFLAGS=-I/opt/sm/pkg/active/include CPATH=/opt/sm/pkg/active/include')#rvm_configure_env=('LDFLAGS=-L/opt/sm/pkg/active/lib' 'CFLAGS=-I/opt/sm/pkg/active/include' 'CPATH=/opt/sm/pkg/active/include')#" /etc/rvmrc

  * No new notes to display.

# RVM:  Shell scripts enabling management of multiple ruby environments.
# RTFM: https://rvm.io/
# HELP: http://webchat.freenode.net/?channels=rvm (#rvm on irc.freenode.net)
# Cheatsheet: http://cheat.errtheblog.com/s/rvm/
# Screencast: http://screencasts.org/episodes/how-to-use-rvm

# In case of any issues read output of 'rvm requirements' and/or 'rvm notes'

Upgrade of RVM in /usr/local/rvm/ is complete.

# hinmn,
#
#   Thank you for using RVM!
#   I sincerely hope that RVM helps to make your life easier and
#   more enjoyable!!!
#
# ~Wayne

RVM reloaded!

After that I just ran:

sudo sed -i'' -e "s#rvm_configure_env=('LDFLAGS=-L/opt/sm/pkg/active/lib CFLAGS=-I/opt/sm/pkg/active/include CPATH=/opt/sm/pkg/active/include')#rvm_configure_env=('LDFLAGS=-L/opt/sm/pkg/active/lib' 'CFLAGS=-I/opt/sm/pkg/active/include' 'CPATH=/opt/sm/pkg/active/include')#" /etc/rvmrc

And everything worked out :)

  • Further note: I have a feeling if I had run rvm get head earlier, I may have avoided installing/re-installing some of the packages. – brennebeck Dec 24 '12 at 2:27
  • I concur - simply doing rvm get head followed by brew update and brew install ... (bunch of missing packages) did the trick for me. – Thilo Mar 7 '13 at 18:41
  • Yeah, I haven't had any problems since I got everything working. I was definitely having a hard time for a while though. rvm on Linux 'just works' in my experience. – brennebeck Mar 10 '13 at 9:57
0

I had similar problems and it turned out I didn't have some packages installed, mainly these:

libxslt @1.1.27_0 (active)
libyaml @0.1.4_1 (active)
llvm-3.2 @3.2_1 (active)
llvm_select @0.2_0 (active)

llvm-3.2 is the gcc compiler I believe was the main problem because openssl wasn't able to run ./Configure and Make.

Check if these are installed first and maybe it'll help before having to reinstall everything. Took me 2 days to get Ruby 2.0.0 / Rails 3.1.1 working, hope this helps someone.

  • I thought Homebrew would automatically install all required packages – user151019 Mar 17 '13 at 11:36

You must log in to answer this question.

Not the answer you're looking for? Browse other questions tagged .