0

Trying to compile APFS fuse to grab files off of a OSX partition;

recieve errors when compiling:

87%] Building CXX object CMakeFiles/apfs-fuse.dir/apfsfuse/ApfsFuse.cpp.o
/home/avgv5tv5linux/apfs-fuse/apfsfuse/ApfsFuse.cpp:23:23: fatal error: fuse/fuse.h: No such file or directory
compilation terminated.
CMakeFiles/apfs-fuse.dir/build.make:62: recipe for target 'CMakeFiles/apfs-fuse.dir/apfsfuse/ApfsFuse.cpp.o' failed
make[2]: *** [CMakeFiles/apfs-fuse.dir/apfsfuse/ApfsFuse.cpp.o] Error 1
CMakeFiles/Makefile2:106: recipe for target 'CMakeFiles/apfs-fuse.dir/all' failed
make[1]: *** [CMakeFiles/apfs-fuse.dir/all] Error 2
Makefile:83: recipe for target 'all' failed
make: *** [all] Error 2
  • What kind of system are you trying to build apfs-fuse on? – duskwuff Apr 7 at 17:54

You must log in to answer this question.

Browse other questions tagged .